Reaction Details
TargetEpidermal growth factor receptor
LigandBDBM50141147
Substrate/Competitorn/a
Meas. Tech.ChEMBL_63780 (CHEMBL677384)
IC50 4129±n/a nM
Citation Wissner, AHamann, PRNilakantan, RGreenberger, LMYe, FRapuano, TALoganzo, F Syntheses and EGFR kinase inhibitory activity of 6-substituted-4-anilino [1,7] and [1,8] naphthyridine-3-carbonitriles. Bioorg Med Chem Lett14:1411-6 (2004) 
 
Epidermal growth factor receptor
Name:Epidermal growth factor receptor
Type:Receptor Kinase Domain
Mol. Mass.:134279.59
Organism:Homo sapiens (Human)
Description:P00533
Residue:1210
BDBM50141147
NameBDBM50141147
Synonyms:(E)-4-Dimethylamino-but-2-enoic acid [5-(3-bromo-phenylamino)-6-cyano-[1,8]naphthyridin-3-yl]-amide | CHEMBL441518
TypeSmall organic molecule
Emp. Form.C21H19BrN6O
Mol. Mass.451.319
SMILESCN(C)C\C=C\C(=O)Nc1cnc2ncc(C#N)c(Nc3cccc(Br)c3)c2c1