Reaction Details
TargetEpidermal growth factor receptor
LigandBDBM50141148
Substrate/Competitorn/a
Meas. Tech.ChEMBL_63780 (CHEMBL677384)
IC50 976±n/a nM
Citation Wissner, AHamann, PRNilakantan, RGreenberger, LMYe, FRapuano, TALoganzo, F Syntheses and EGFR kinase inhibitory activity of 6-substituted-4-anilino [1,7] and [1,8] naphthyridine-3-carbonitriles. Bioorg Med Chem Lett14:1411-6 (2004) 
 
Epidermal growth factor receptor
Name:Epidermal growth factor receptor
Type:Receptor Kinase Domain
Mol. Mass.:134279.59
Organism:Homo sapiens (Human)
Description:P00533
Residue:1210
BDBM50141148
NameBDBM50141148
Synonyms:CHEMBL281467 | N-[5-(3-Bromo-phenylamino)-6-cyano-[1,8]naphthyridin-3-yl]-acrylamide
TypeSmall organic molecule
Emp. Form.C18H12BrN5O
Mol. Mass.394.225
SMILESBrc1cccc(Nc2c(cnc3ncc(NC(=O)C=C)cc23)C#N)c1