Reaction Details
TargetEpidermal growth factor receptor
LigandBDBM50122567
Substrate/Competitorn/a
Meas. Tech.ChEMBL_63781 (CHEMBL677385)
IC50 37±n/a nM
Citation Wissner, AHamann, PRNilakantan, RGreenberger, LMYe, FRapuano, TALoganzo, F Syntheses and EGFR kinase inhibitory activity of 6-substituted-4-anilino [1,7] and [1,8] naphthyridine-3-carbonitriles. Bioorg Med Chem Lett14:1411-6 (2004) 
 
Epidermal growth factor receptor
Name:Epidermal growth factor receptor
Type:Receptor Kinase Domain
Mol. Mass.:134279.59
Organism:Homo sapiens (Human)
Description:P00533
Residue:1210
BDBM50122567
NameBDBM50122567
Synonyms:(E)-4-Dimethylamino-but-2-enoic acid [4-(3-bromo-phenylamino)-3-cyano-quinolin-6-yl]-amide CHEMBL30973
TypeSmall organic molecule
Emp. Form.C22H20BrN5O
Mol. Mass.450.331
SMILESCN(C)C\C=C\C(=O)Nc1ccc2ncc(C#N)c(Nc3cccc(Br)c3)c2c1