Reaction Details
TargetIntegrase
LigandBDBM23399
Substrate/Competitorn/a
Meas. Tech.ChEMBL_90870 (CHEMBL699303)
IC50 126±n/a nM
Citation Mustata, GIBrigo, ABriggs, JM HIV-1 integrase pharmacophore model derived from diverse classes of inhibitors. Bioorg Med Chem Lett14:1447-54 (2004) 
 
Integrase
Name:Integrase
Synonyms:Human immunodeficiency virus type 1 integrase
Type:PROTEIN
Mol. Mass.:32231.48
Organism:Human immunodeficiency virus 1
Description:ChEMBL_90865
Residue:288
BDBM23399
NameBDBM23399
TypeSmall organic molecule
Emp. Form.C15H12FNO4
Mol. Mass.289.2585
SMILESOC(=O)C(=O)CC(=O)c1cccn1Cc1ccc(F)cc1