Reaction Details
TargetIntegrase
LigandBDBM50056937
Substrate/Competitorn/a
Meas. Tech.ChEMBL_90870 (CHEMBL699303)
IC50 600±n/a nM
Citation Mustata, GIBrigo, ABriggs, JM HIV-1 integrase pharmacophore model derived from diverse classes of inhibitors. Bioorg Med Chem Lett14:1447-54 (2004) 
 
Integrase
Name:Integrase
Synonyms:Human immunodeficiency virus type 1 integrase
Type:PROTEIN
Mol. Mass.:32231.48
Organism:Human immunodeficiency virus 1
Description:ChEMBL_90865
Residue:288
BDBM50056937
NameBDBM50056937
TypeSmall organic molecule
Emp. Form.C14H10O9
Mol. Mass.322.2238
SMILESOC(=O)c1cc(O)c(O)c(OC(=O)c2cc(O)c(O)c(O)c2)c1