Reaction Details
TargetIntegrase
LigandBDBM50141232
Substrate/Competitorn/a
Meas. Tech.ChEMBL_90870 (CHEMBL699303)
IC50 370±n/a nM
Citation Mustata, GIBrigo, ABriggs, JM HIV-1 integrase pharmacophore model derived from diverse classes of inhibitors. Bioorg Med Chem Lett14:1447-54 (2004) 
 
Integrase
Name:Integrase
Synonyms:Human immunodeficiency virus type 1 integrase
Type:PROTEIN
Mol. Mass.:32231.48
Organism:Human immunodeficiency virus 1
Description:ChEMBL_90865
Residue:288
BDBM50141232
NameBDBM50141232
Synonyms:3-[3-((E)-3,4-Dihydroxy-phenyl)-acryloylamino]-2-[(E)-3-(3,4-dihydroxy-phenyl)-acryloyloxy]-propionic acid anion
TypeSmall organic molecule
Emp. Form.C21H18NO9
Mol. Mass.428.3695
SMILESOc1ccc(\C=C\C(=O)NCC(OC(=O)\C=C\c2ccc(O)c(O)c2)C([O-])=O)cc1O