Reaction Details
TargetFatty acid synthase
LigandBDBM50142505
Substrate/Competitorn/a
Meas. Tech.ChEBML_68769
Ki 100000±n/a nM
Citation Guérard, CBréard, MCourtois, FDrujon, TPloux, O Synthesis and evaluation of analogues of S-adenosyl-L-methionine, as inhibitors of the E. coli cyclopropane fatty acid synthase. Bioorg Med Chem Lett14:1661-4 (2004) 
 
Fatty acid synthase
Name:Fatty acid synthase
Type:Enzyme
Mol. Mass.:273419.37
Organism:Homo sapiens (Human)
Description:P49327
Residue:2511
BDBM50142505
NameBDBM50142505
Synonyms:2-Amino-4-[(2S,3S,4R,5R)-5-(6-amino-purin-9-yl)-3,4-dihydroxy-tetrahydro-furan-2-ylmethanesulfonyl]-butyric acid | CHEMBL47994
TypeSmall organic molecule
Emp. Form.C14H20N6O7S
Mol. Mass.416.41
SMILESN[C@@H](CCS(=O)(=O)C[C@H]1O[C@H]([C@H](O)[C@@H]1O)n1cnc2c(N)ncnc12)C(O)=O