Reaction Details
TargetNeuronal acetylcholine receptor subunit alpha-2/beta-2
LigandBDBM82070
Substrate/Competitorn/a
Meas. Tech.ChEMBL_143227 (CHEMBL750088)
Ki 15±n/a nM
Citation Xiao, YBaydyuk, MWang, HPDavis, HEKellar, KJ Pharmacology of the agonist binding sites of rat neuronal nicotinic receptor subtypes expressed in HEK 293 cells. Bioorg Med Chem Lett14:1845-8 (2004) 
 
Neuronal acetylcholine receptor subunit alpha-2/beta-2
Name:Neuronal acetylcholine receptor subunit alpha-2/beta-2
Type:n/a
Mol. Mass.:n/a
Description:ASSAY_ID of EBI is 143226
Components:This complex has 2 components.
Component 1
Name:Neuronal acetylcholine receptor subunit alpha-2
Synonyms:ACHA2_RAT Cholinergic, Nicotinic Alpha2Beta2 Chrna2
Type:Enzyme
Mol. Mass.:58597.25
Organism:Rattus norvegicus (Rat)
Description:P12389
Residue:511
Component 2
Name:Neuronal acetylcholine receptor subunit beta-2
Synonyms:ACHB2_RAT Chrnb2 Neuronal acetylcholine receptor non-alpha-1 chain
Type:Enzyme
Mol. Mass.:56910.32
Organism:Rattus norvegicus (Rat)
Description:P12390
Residue:500
BDBM82070
NameBDBM82070
Synonyms:CAS_29790-52-1 Nicotine-D salicylate US9303017, Nicotine
Typen/a
Emp. Form.C10H14N2
Mol. Mass.162.2316
SMILESCN1CCC[C@H]1c1cccnc1