Reaction Details
TargetNeuronal acetylcholine receptor subunit alpha-3/beta-2
LigandBDBM50143281
Substrate/Competitorn/a
Meas. Tech.ChEMBL_143250 (CHEMBL752538)
Ki 0.420000±n/a nM
Citation Xiao, YBaydyuk, MWang, HPDavis, HEKellar, KJ Pharmacology of the agonist binding sites of rat neuronal nicotinic receptor subtypes expressed in HEK 293 cells. Bioorg Med Chem Lett14:1845-8 (2004) 
 
Neuronal acetylcholine receptor subunit alpha-3/beta-2
Name:Neuronal acetylcholine receptor subunit alpha-3/beta-2
Type:Protein
Mol. Mass.:n/a
Description:n/a
Components:This complex has 2 components.
Component 1
Name:Neuronal acetylcholine receptor subunit alpha-3
Synonyms:ACHA3_RAT Chrna3
Type:Enzyme
Mol. Mass.:56995.52
Organism:Rattus norvegicus (Rat)
Description:P04757
Residue:499
Component 2
Name:Neuronal acetylcholine receptor subunit beta-2
Synonyms:ACHB2_RAT Chrnb2 Neuronal acetylcholine receptor non-alpha-1 chain
Type:Enzyme
Mol. Mass.:56910.32
Organism:Rattus norvegicus (Rat)
Description:P12390
Residue:500
BDBM50143281
NameBDBM50143281
Synonyms:3-((S)-Azetidin-2-yloxy)-5-iodo-pyridine | CHEMBL55138
TypeSmall organic molecule
Emp. Form.C8H9IN2O
Mol. Mass.276.0743
SMILESIc1cncc(O[C@H]2CCN2)c1