Reaction Details
TargetGamma-secretase subunit APH-1A/Gamma-secretase subunit APH-1B/Gamma-secretase subunit PEN-2/Nicastrin/Presenilin-1/Presenilin-2
LigandBDBM50143442
Substrate/Competitorn/a
Meas. Tech.ChEMBL_42222 (CHEMBL654703)
IC50 230±n/a nM
Citation Esler, WPDas, CWolfe, MS Probing pockets S2-S4' of the gamma-secretase active site with (hydroxyethyl)urea peptidomimetics. Bioorg Med Chem Lett14:1935-8 (2004) 
 
Gamma-secretase subunit APH-1A/Gamma-secretase subunit APH-1B/Gamma-secretase subunit PEN-2/Nicastrin/Presenilin-1/Presenilin-2
Name:Gamma-secretase subunit APH-1A/Gamma-secretase subunit APH-1B/Gamma-secretase subunit PEN-2/Nicastrin/Presenilin-1/Presenilin-2
Type:n/a
Mol. Mass.:n/a
Description:ASSAY_ID of EBI is 68900
Components:This complex has 6 components.
Component 1
Name:Gamma-secretase subunit APH-1B
Synonyms:APH-1b APH1B_HUMAN Gamma-secretase PSFL | Presenilin-stabilization factor-like
Type:PROTEIN
Mol. Mass.:28468.17
Organism:Homo sapiens (Human)
Description:EBI_10231
Residue:257
Component 2
Name:Presenilin-2
Synonyms:AD3LP AD5 Gamma-secretase PS2 PSN2_HUMAN Presenilin 2 Presenilin-2 CTF subunit STM-2 | STM2
Type:PROTEIN
Mol. Mass.:50116.65
Organism:Homo sapiens (Human)
Description:ChEMBL_855576
Residue:448
Component 3
Name:Gamma-secretase subunit APH-1A
Synonyms:APH-1a APH1A_HUMAN Gamma-Secretase Subunit APH-1A Presenilin-stabilization factor
Type:Enzyme subunit; multi-pass membrane protein
Mol. Mass.:28998.73
Organism:Homo sapiens (Human)
Description:n/a
Residue:265
Component 4
Name:Nicastrin
Synonyms:Gamma-secretase NCSTN Nicastrin
Type:PROTEIN
Mol. Mass.:78404.96
Organism:Homo sapiens (Human)
Description:EBI_10683
Residue:709
Component 5
Name:Presenilin-1
Synonyms:3.4.23.- Gamma-Secretase Subunit Presenilin-1 PS1 PSEN1 PSNL1 Presenilin-1 CTF12 Protein S182
Type:n/a
Mol. Mass.:52657.13
Organism:Homo sapiens (Human)
Description:P49768
Residue:467
Component 6
Name:Gamma-secretase subunit PEN-2
Synonyms:Gamma-Secretase Subunit PEN-2 PEN2 PSENEN | Presenilin enhancer protein 2
Type:Enzyme subunit; multi-pass membrane protein
Mol. Mass.:12031.98
Organism:Homo sapiens (Human)
Description:n/a
Residue:101
BDBM50143442
NameBDBM50143442
Synonyms:(S)-2-((S)-2-{3-Benzyl-3-[(2R,3S)-3-((S)-2-tert-butoxycarbonylamino-4-methyl-pentanoylamino)-2-hydroxy-4-phenyl-butyl]-ureido}-4-methyl-pentanoylamino)-3-methyl-butyric acid methyl ester | CHEMBL177080
TypeSmall organic molecule
Emp. Form.C41H63N5O8
Mol. Mass.753.9676
SMILESCOC(=O)[C@@H](NC(=O)[C@H](CC(C)C)NC(=O)N(C[C@@H](O)[C@H](Cc1ccccc1)NC(=O)[C@H](CC(C)C)NC(=O)OC(C)(C)C)Cc1ccccc1)C(C)C