Reaction Details
Target5-hydroxytryptamine receptor 6
LigandBDBM50143487
Substrate/Competitorn/a
Meas. Tech.ChEBML_3626
Ki 0.300000±n/a nM
Citation Chang-Fong, JRangisetty, JBDukat, MSetola, VRaffay, TRoth, BGlennon, RA 1,2,3,4-tetrahydrocarbazoles as 5-HT6 serotonin receptor ligands. Bioorg Med Chem Lett14:1961-4 (2004) 
 
5-hydroxytryptamine receptor 6
Name:5-hydroxytryptamine receptor 6
Type:G Protein-Coupled Receptor (GPCR)
Mol. Mass.:46968.43
Organism:Homo sapiens (Human)
Description:P50406
Residue:440
BDBM50143487
NameBDBM50143487
Synonyms:CHEMBL353552 | [9-(2,5-Dimethoxy-benzenesulfonyl)-6-methoxy-2,3,4,9-tetrahydro-1H-carbazol-4-ylmethyl]-dimethyl-amine
TypeSmall organic molecule
Emp. Form.C24H30N2O5S
Mol. Mass.458.57
SMILESCOc1ccc(OC)c(c1)S(=O)(=O)n1c2CCCC(CN(C)C)c2c2cc(OC)ccc12