Reaction Details
TargetCarbonic anhydrase 4
LigandBDBM11641
Substrate/Competitorn/a
Meas. Tech.ChEBML_45430
Ki 60±n/a nM
Citation Pastorekova, SCasini, AScozzafava, AVullo, DPastorek, JSupuran, CT Carbonic anhydrase inhibitors: the first selective, membrane-impermeant inhibitors targeting the tumor-associated isozyme IX. Bioorg Med Chem Lett14:869-73 (2004) 
 
Carbonic anhydrase 4
Name:Carbonic anhydrase 4
Type:Enzyme
Mol. Mass.:35152.74
Organism:Bos taurus (bovine)
Description:Bovine isozyme, isolated from lung microsomes
Residue:312
BDBM11641
NameBDBM11641
Synonyms:1-N-(4-sulfamoylphenyl-ethyl)-2,4,6-trimethylpyridiniumperchlorate CHEMBL352535 pyridinium deriv. 10
TypeSmall organic molecule
Emp. Form.C16H21N2O2S
Mol. Mass.305.415
SMILESCc1cc(C)[n+](CCc2ccc(cc2)S(N)(=O)=O)c(C)c1