Reaction Details
TargetAldehyde oxidase
LigandBDBM50366977
Substrate/Competitorn/a
Meas. Tech.ChEBML_31305
Ki 300000±n/a nM
Citation Cates, LAJones, GSGood, DJTsai, HYLi, VSCaron, NTu, SCKimball, AP Cyclophosphamide potentiation and aldehyde oxidase inhibition by phosphorylated aldehydes and acetals. J Med Chem23:300-4 (1980) Aldehyde oxidase
Name:Aldehyde oxidase
Type:PROTEIN
Mol. Mass.:147930.97
Organism:Homo sapiens (Human)
Description:ChEMBL_1481150
Residue:1338
BDBM50366977
NameBDBM50366977
Synonyms:CHEMBL103253
TypeSmall organic molecule
Emp. Form.C6H13O4P
Mol. Mass.180.1388
SMILESCCOP(=O)(CC=O)OCC