Reaction Details
TargetCytidine deaminase
LigandBDBM50366987
Substrate/Competitorn/a
Meas. Tech.ChEMBL_52525 (CHEMBL665297)
Ki 9000±n/a nM
Citation Marquez, VELiu, PSKelley, JADriscoll, JSMcCormack, JJ Synthesis of 1,3-diazepin-2-one nucleosides as transition-state inhibitors of cytidine deaminase. J Med Chem23:713-5 (1980) Cytidine deaminase
Name:Cytidine deaminase
Type:Ezyme
Mol. Mass.:16185.04
Organism:Homo sapiens (Human)
Description:P32320
Residue:146
BDBM50366987
NameBDBM50366987
Synonyms:CHEMBL608479
TypeSmall organic molecule
Emp. Form.C10H16N2O6
Mol. Mass.260.2438
SMILESOC[C@H]1OC([C@H](O)[C@@H]1O)N1CCC(=O)CNC1=O