Reaction Details
TargetPhenylethanolamine N-methyltransferase
LigandBDBM50028786
Substrate/Competitorn/a
Meas. Tech.ChEMBL_152417 (CHEMBL763764)
IC50 193000±n/a nM
Citation Davis, DPBorchardt, RTGrunewald, GL Importance of the aromatic ring in adrenergic amines. 6. Nonaromatic analogues of phenylethanolamine as inhibitors of phenylethanolamine N-methyltransferase: role of pi-electronic and steric interactions. J Med Chem24:12-6 (1981) Phenylethanolamine N-methyltransferase
Name:Phenylethanolamine N-methyltransferase
Type:Enzyme
Mol. Mass.:30916.97
Organism:Bos taurus (bovine)
Description:n/a
Residue:283
BDBM50028786
NameBDBM50028786
Synonyms:(endo)2-Amino-1-bicyclo[2.2.1]hept-2-yl-ethanol: Sulfate CHEMBL40242
TypeSmall organic molecule
Emp. Form.C9H17NO
Mol. Mass.155.2374
SMILESNCC(O)C1CC2CCC1C2