Reaction Details
TargetDelta-type opioid receptor
LigandBDBM21025
Substrate/Competitorn/a
Meas. Tech.ChEBML_145899
IC50 0.540000±n/a nM
Citation Gacel, GFournié-Zaluski, MCFellion, ERoques, BP Evidence of the preferential involvement of mu receptors in analgesia using enkephalins highly selective for peripheral mu or delta receptors. J Med Chem24:1119-24 (1982) Delta-type opioid receptor
Name:Delta-type opioid receptor
Type:Enzyme Catalytic Domain
Mol. Mass.:40577.25
Organism:MOUSE
Description:P32300
Residue:372
BDBM21025
NameBDBM21025
Synonyms:(2R)-2-[(2S)-2-{2-[(2R)-2-[(2S)-2-amino-3-(4-hydroxyphenyl)propanamido]propanamido]acetamido}-3-phenylpropanamido]-4-methylpentanoic acid BW-180C DADLE H-Tyr-D-Ala-Gly-Phe-D-Leu-OH | [D-Ala2-D-Leu5]enkephalin
TypeANALGESIC
Emp. Form.C29H39N5O7
Mol. Mass.569.6493
SMILESCC(C)C[C@@H](NC(=O)[C@H](Cc1ccccc1)NC(=O)CNC(=O)[C@@H](C)NC(=O)[C@@H](N)Cc1ccc(O)cc1)C(O)=O