Reaction Details
TargetCatechol O-methyltransferase
LigandBDBM50367031
Substrate/Competitorn/a
Meas. Tech.ChEBML_47238
Ki 800000±n/a nM
Citation Anderson, GLBussolotti, DLCoward, JK Synthesis and evaluation of some stable multisubstrate adducts as inhibitors of catechol O-methyltransferase. J Med Chem24:1271-7 (1982) Catechol O-methyltransferase
Name:Catechol O-methyltransferase
Type:Enzyme
Mol. Mass.:30030.67
Organism:Homo sapiens (Human)
Description:P21964
Residue:271
BDBM50367031
NameBDBM50367031
Synonyms:CHEMBL557014
TypeSmall organic molecule
Emp. Form.C20H26N5O5S
Mol. Mass.448.515
SMILESCOc1ccccc1CC[S+](C)OC[C@H]1O[C@H]([C@H](O)[C@@H]1O)n1cnc2c(N)ncnc12