Reaction Details
TargetAdenosine deaminase
LigandBDBM22925
Substrate/Competitorn/a
Meas. Tech.ChEBML_30975
Ki 0.100000±n/a nM
Citation Bastian, GBessodes, MPanzica, RPAbushanab, EChen, SFStoeckler, JDParks, RE Adenosine deaminase inhibitors. Conversion of a single chiral synthon into erythro- and threo-9-(2-hydroxy-3-nonyl)adenines. J Med Chem24:1383-5 (1982) Adenosine deaminase
Name:Adenosine deaminase
Type:Enzyme
Mol. Mass.:40759.44
Organism:Homo sapiens (Human)
Description:Human recombinant ADA was expressed and purified from an ADA-deficient bacterial strain.
Residue:363
BDBM22925
NameBDBM22925
Synonyms:(8R)-3-[(2R,4S,5R)-4-hydroxy-5-(hydroxymethyl)oxolan-2-yl]-3H,6H,7H,8H-imidazo[4,5-d][1,3]diazepin-8-ol Deoxycoformycin Pentostatin
TypeNucleoside or nucleotide
Emp. Form.C11H16N4O4
Mol. Mass.268.2691
SMILESOC[C@H]1O[C@H](C[C@@H]1O)n1cnc2[C@H](O)CNC=Nc12