Reaction Details
TargetCholine O-acetyltransferase
LigandBDBM50029029
Substrate/Competitorn/a
Meas. Tech.ChEMBL_49269 (CHEMBL662976)
Ki 8000±n/a nM
Citation Mautner, HGMerrill, RECurrier, SFHarvey, G Interaction of aromatic dyes with the coenzyme A binding site of choline acetyltransferase. J Med Chem24:1534-7 (1982) Choline O-acetyltransferase
Name:Choline O-acetyltransferase
Type:PROTEIN
Mol. Mass.:82561.12
Organism:Homo sapiens (Human)
Description:ChEMBL_49268
Residue:748
BDBM50029029
NameBDBM50029029
Synonyms:(tetraidofluorescein)2-(6-Hydroxy-2,4,5,7-tetraiodo-5-methyl-3-oxo-3H-xanthen-9-yl)-benzoic acid
TypeSmall organic molecule
Emp. Form.C20H6I4O5
Mol. Mass.833.8776
SMILES[O-]C(=O)c1ccccc1-c1c2cc(I)c([O-])c(I)c2oc2c(I)c(=O)c(I)cc12