Reaction Details
TargetCholine O-acetyltransferase
LigandBDBM50029033
Substrate/Competitorn/a
Meas. Tech.ChEMBL_49269 (CHEMBL662976)
Ki 150000±n/a nM
Citation Mautner, HGMerrill, RECurrier, SFHarvey, G Interaction of aromatic dyes with the coenzyme A binding site of choline acetyltransferase. J Med Chem24:1534-7 (1982) Choline O-acetyltransferase
Name:Choline O-acetyltransferase
Type:PROTEIN
Mol. Mass.:82561.12
Organism:Homo sapiens (Human)
Description:ChEMBL_49268
Residue:748
BDBM50029033
NameBDBM50029033
Synonyms:7-Phenylamino-naphthalene-1-sulfonic acid anion
TypeSmall organic molecule
Emp. Form.C16H12NO3S
Mol. Mass.298.337
SMILES[O-]S(=O)(=O)c1cccc2ccc(Nc3ccccc3)cc12