Reaction Details
TargetCholine O-acetyltransferase
LigandBDBM50029036
Substrate/Competitorn/a
Meas. Tech.ChEMBL_49269 (CHEMBL662976)
Ki 1800±n/a nM
Citation Mautner, HGMerrill, RECurrier, SFHarvey, G Interaction of aromatic dyes with the coenzyme A binding site of choline acetyltransferase. J Med Chem24:1534-7 (1982) Choline O-acetyltransferase
Name:Choline O-acetyltransferase
Type:PROTEIN
Mol. Mass.:82561.12
Organism:Homo sapiens (Human)
Description:ChEMBL_49268
Residue:748
BDBM50029036
NameBDBM50029036
Synonyms:1-Amino-4-{4-[4-hydroxy-6-(4-sulfo-phenylamino)-[1,3,5]triazin-2-ylamino]-3-sulfo-phenylamino}-9,10-dioxo-9,10-dihydro-anthracene-2-sulfonic acid
TypeSmall organic molecule
Emp. Form.C29H18N7O12S3
Mol. Mass.752.69
SMILESNc1c(cc(Nc2ccc(Nc3nc(Nc4ccc(cc4)S([O-])(=O)=O)nc(=O)[nH]3)c(c2)S([O-])(=O)=O)c2C(=O)c3ccccc3C(=O)c12)S([O-])(=O)=O