Reaction Details
TargetCytidine deaminase
LigandBDBM50367034
Substrate/Competitorn/a
Meas. Tech.ChEBML_52523
Ki 25±n/a nM
Citation Liu, PSMarquez, VEDriscoll, JSFuller, RWMcCormack, JJ Cyclic urea nucleosides. Cytidine deaminase activity as a function of aglycon ring size. J Med Chem24:662-6 (1981) Cytidine deaminase
Name:Cytidine deaminase
Type:Ezyme
Mol. Mass.:16185.04
Organism:Homo sapiens (Human)
Description:P32320
Residue:146
BDBM50367034
NameBDBM50367034
Synonyms:CHEMBL610997
TypeSmall organic molecule
Emp. Form.C10H16N2O5
Mol. Mass.244.2444
SMILESOC[C@H]1OC([C@H](O)[C@@H]1O)N1CC=CCNC1=O