Reaction Details
TargetAdenosine receptor A1
LigandBDBM50118810
Substrate/Competitorn/a
Meas. Tech.ChEBML_39959
Ki 0.250000±n/a nM
Citation Daly, JW Adenosine receptors: targets for future drugs. J Med Chem25:197-207 (1982) Adenosine receptor A1
Name:Adenosine receptor A1
Type:Enzyme Catalytic Domain
Mol. Mass.:36602.99
Organism:BOVINE
Description:ADENOSINE 0 BOVINE::P28190
Residue:326
BDBM50118810
NameBDBM50118810
Synonyms:(2R,3S,4R,5R)-2-(hydroxymethyl)-5-(6-((R)-1-phenylpropan-2-ylamino)-9H-purin-9-yl)-tetrahydrofuran-3,4-diol CHEMBL139000 R-N6-(phenylisopropyl)adenosine
TypeSmall organic molecule
Emp. Form.C19H23N5O4
Mol. Mass.385.417
SMILESC[C@H](Cc1ccccc1)Nc1ncnc2n(cnc12)[C@@H]1O[C@H](CO)[C@@H](O)[C@H]1O