Reaction Details
TargetAdenosine receptor A2a
LigandBDBM50009525
Substrate/Competitorn/a
Meas. Tech.ChEBML_75662
Ki 8±n/a nM
Citation Daly, JW Adenosine receptors: targets for future drugs. J Med Chem25:197-207 (1982) Adenosine receptor A2a
Name:Adenosine receptor A2a
Type:Enzyme Catalytic Domain
Mol. Mass.:44955.08
Organism:GUINEA PIG
Description:ADENOSINE A2 0 GUINEA PIG::P46616
Residue:409
BDBM50009525
NameBDBM50009525
Synonyms:2-CI Adenosine 2-Chloroado CHEMBL285819
TypeSmall organic molecule
Emp. Form.C10H12ClN5O4
Mol. Mass.301.686
SMILESNc1nc(Cl)nc2n(cnc12)[C@@H]1O[C@H](CO)[C@@H](O)[C@H]1O