Reaction Details
TargetBeta-1 adrenergic receptor
LigandBDBM50405521
Substrate/Competitorn/a
Meas. Tech.ChEMBL_39160 (CHEMBL650686)
IC50 37±n/a nM
Citation Baldwin, JJMcClure, DEGross, DMWilliams, M Use of (S)-(trifloxymethyl)oxirane in the synthesis of a chiral beta-adrenoceptor antagonist, (R)- and (S)-9-[[3-(tert-butylamino)-2-hydroxypropyl]oximino]fluorene. J Med Chem25:931-6 (1982) Beta-1 adrenergic receptor
Name:Beta-1 adrenergic receptor
Type:G Protein-Coupled Receptor (GPCR)
Mol. Mass.:51338.40
Organism:Homo sapiens (Human)
Description:P08588
Residue:477
BDBM50405521
NameBDBM50405521
Synonyms:ALO 1401-02 BETAXOLOL HYDROCHLORIDE | Betaxolol
TypeSmall organic molecule
Emp. Form.C18H29NO3
Mol. Mass.307.4278
SMILESCC(C)NCC(O)COc1ccc(CCOCC2CC2)cc1