Reaction Details
TargetBeta-1 adrenergic receptor
LigandBDBM50367112
Substrate/Competitorn/a
Meas. Tech.ChEBML_39161
IC50 43±n/a nM
Citation Baldwin, JJMcClure, DEGross, DMWilliams, M Use of (S)-(trifloxymethyl)oxirane in the synthesis of a chiral beta-adrenoceptor antagonist, (R)- and (S)-9-[[3-(tert-butylamino)-2-hydroxypropyl]oximino]fluorene. J Med Chem25:931-6 (1982) Beta-1 adrenergic receptor
Name:Beta-1 adrenergic receptor
Type:G Protein-Coupled Receptor (GPCR)
Mol. Mass.:51338.40
Organism:Homo sapiens (Human)
Description:P08588
Residue:477
BDBM50367112
NameBDBM50367112
Synonyms:CHEMBL1788270
TypeSmall organic molecule
Emp. Form.C20H24N2O2
Mol. Mass.324.4168
SMILES[#6]C([#6])([#6])[#7]-[#6]-[#6@@H](-[#8])-[#6]-[#8]\[#7]=[#6]-1\c2ccccc2-c2ccccc-12