Reaction Details
TargetAlpha-2A adrenergic receptor
LigandBDBM50027032
Substrate/Competitorn/a
Meas. Tech.ChEMBL_33033 (CHEMBL643958)
Ki 14±n/a nM
Citation Saari, WSHalczenko, WRandall, WCLotti, VJ alpha-Adrenergic activities of some substituted 2-(aminomethyl)imidazolines. J Med Chem26:1769-72 (1984) Alpha-2A adrenergic receptor
Name:Alpha-2A adrenergic receptor
Type:Enzyme Catalytic Domain
Mol. Mass.:49275.13
Organism:BOVINE
Description:adrenergic Alpha2 0 BOVINE::Q28838
Residue:452
BDBM50027032
NameBDBM50027032
Synonyms:(4,5-Dihydro-1H-imidazol-2-ylmethyl)-p-tolyl-amine | CHEMBL300053
TypeSmall organic molecule
Emp. Form.C11H15N3
Mol. Mass.189.2569
SMILESCc1ccc(NCC2=NCCN2)cc1