Reaction Details
TargetAlpha-2A adrenergic receptor
LigandBDBM50027037
Substrate/Competitorn/a
Meas. Tech.ChEBML_33034
Ki 14±n/a nM
Citation Saari, WSHalczenko, WRandall, WCLotti, VJ alpha-Adrenergic activities of some substituted 2-(aminomethyl)imidazolines. J Med Chem26:1769-72 (1984) Alpha-2A adrenergic receptor
Name:Alpha-2A adrenergic receptor
Type:Enzyme Catalytic Domain
Mol. Mass.:49275.13
Organism:BOVINE
Description:adrenergic Alpha2 0 BOVINE::Q28838
Residue:452
BDBM50027037
NameBDBM50027037
Synonyms:(4,5-Dihydro-1H-imidazol-2-ylmethyl)-ethyl-p-tolyl-amine | CHEMBL49953
TypeSmall organic molecule
Emp. Form.C13H19N3
Mol. Mass.217.3101
SMILESCCN(CC1=NCCN1)c1ccc(C)cc1