Reaction Details
TargetAlpha-2A adrenergic receptor
LigandBDBM50027036
Substrate/Competitorn/a
Meas. Tech.ChEBML_33034
Ki 150±n/a nM
Citation Saari, WSHalczenko, WRandall, WCLotti, VJ alpha-Adrenergic activities of some substituted 2-(aminomethyl)imidazolines. J Med Chem26:1769-72 (1984) Alpha-2A adrenergic receptor
Name:Alpha-2A adrenergic receptor
Type:Enzyme Catalytic Domain
Mol. Mass.:49275.13
Organism:BOVINE
Description:adrenergic Alpha2 0 BOVINE::Q28838
Residue:452
BDBM50027036
NameBDBM50027036
Synonyms:(4,5-Dihydro-1H-imidazol-2-ylmethyl)-methyl-p-tolyl-amine | CHEMBL300628
TypeSmall organic molecule
Emp. Form.C12H17N3
Mol. Mass.203.2835
SMILESCN(CC1=NCCN1)c1ccc(C)cc1