Reaction Details
TargetD(1A)/D(1B)/D(2)/D(3)/D(4) dopamine receptor
LigandBDBM50026951
Substrate/Competitorn/a
Meas. Tech.ChEMBL_216103 (CHEMBL817692)
IC50 43±n/a nM
Citation Bøgesø, KP Neuroleptic activity and dopamine-uptake inhibition in 1-piperazino-3-phenylindans. J Med Chem26:935-47 (1983) D(1A)/D(1B)/D(2)/D(3)/D(4) dopamine receptor
Name:D(1A)/D(1B)/D(2)/D(3)/D(4) dopamine receptor
Synonyms:Dopamine receptor
Type:n/a
Mol. Mass.:n/a
Description:ASSAY_ID of ChEMBL is 60018
Components:This complex has 5 components.
Component 1
Name:D(2) dopamine receptor
Type:G Protein-Coupled Receptor (GPCR)
Mol. Mass.:50931.60
Organism:Rattus norvegicus (rat)
Description:P61169
Residue:444
Component 2
Name:D(1A) dopamine receptor
Synonyms:DOPAMINE D1 Dopamine D1 high Dopamine receptor Dopamine1-like Drd1a
Type:Enzyme Catalytic Domain
Mol. Mass.:49429.75
Organism:RAT
Description:P18901
Residue:446
Component 3
Name:D(3) dopamine receptor
Synonyms:DOPAMINE D3 Dopamine D3 receptor | Drd3
Type:Protein
Mol. Mass.:49540.58
Organism:Rattus norvegicus (Rat)
Description:P19020
Residue:446
Component 4
Name:D(4) dopamine receptor
Synonyms:D(4) dopamine receptor DOPAMINE D4.4 Dopamine receptor | Drd4
Type:Enzyme Catalytic Domain
Mol. Mass.:41307.65
Organism:RAT
Description:DOPAMINE D4.4 0 RAT::P30729
Residue:387
Component 5
Name:D(1B) dopamine receptor
Synonyms:D(1B) dopamine receptor DRD5_RAT Dopamine D5 receptor Drd5
Type:Enzyme Catalytic Domain
Mol. Mass.:52827.88
Organism:RAT
Description:Dopamine D1B 0 RAT::P25115
Residue:475
BDBM50026951
NameBDBM50026951
Synonyms:(cis) 2-{4-[6-Fluoro-3-(4-fluoro-phenyl)-indan-1-yl]-piperazin-1-yl}-ethanol CHEMBL1204347 | CHEMBL136562
TypeSmall organic molecule
Emp. Form.C21H24F2N2O
Mol. Mass.358.4249
SMILESOCCN1CCN(CC1)C1CC(c2ccc(F)cc12)c1ccc(F)cc1