Reaction Details
TargetTransporter
LigandBDBM50021224
Substrate/Competitorn/a
Meas. Tech.ChEMBL_144836 (CHEMBL750462)
IC50 32±n/a nM
Citation Bøgesø, KP Neuroleptic activity and dopamine-uptake inhibition in 1-piperazino-3-phenylindans. J Med Chem26:935-47 (1983) Transporter
Name:Transporter
Type:PROTEIN
Mol. Mass.:66787.87
Organism:Rattus norvegicus
Description:ChEMBL_1463061
Residue:597
BDBM50021224
NameBDBM50021224
Synonyms:(+) (trans) 1-[3-(3,4-Dichloro-phenyl)-indan-1-yl]-4-methyl-piperazine; Dihydrochloride (-) (trans) 1-[3-(3,4-Dichloro-phenyl)-indan-1-yl]-4-methyl-piperazine; Dihydrochloride (cis) 1-[3-(3,4-Dichloro-phenyl)-indan-1-yl]-4-methyl-piperazine; Dihydrochloride 1-[3-(3,4-Dichloro-phenyl)-indan-1-yl]-4-methyl-piperazine | CHEMBL54177
TypeSmall organic molecule
Emp. Form.C20H22Cl2N2
Mol. Mass.361.308
SMILESCN1CCN(CC1)C1CC(c2ccccc12)c1ccc(Cl)c(Cl)c1