Reaction Details
Target5-hydroxytryptamine receptor 1A/1B/1D/1F
LigandBDBM50026963
Substrate/Competitorn/a
Meas. Tech.ChEMBL_201211 (CHEMBL804007)
Ki 14±n/a nM
Citation Remy, DCBritcher, SFKing, SWAnderson, PSHunt, CARandall, WCBélanger, PAtkinson, JGGirard, YRooney, CSFuentes, JJTotaro, JARobinson, JLRisley, EAWilliams, M Synthesis and receptor binding studies relevant to the neuroleptic activities of some 1-methyl-4-piperidylidene-9-substituted-pyrrolo[2,1-b][3]benzazepine derivatives. J Med Chem26:974-80 (1983) 5-hydroxytryptamine receptor 1A/1B/1D/1F
Name:5-hydroxytryptamine receptor 1A/1B/1D/1F
Synonyms:Serotonin 1 (5-HT1) receptor
Type:n/a
Mol. Mass.:n/a
Description:ASSAY_ID of ChEMBL is 193825
Components:This complex has 4 components.
Component 1
Name:5-hydroxytryptamine receptor 1D
Type:Enzyme Catalytic Domain
Mol. Mass.:41551.75
Organism:RAT
Description:5-HT1D HTR1D RAT::P28565
Residue:374
Component 2
Name:5-hydroxytryptamine receptor 1A
Synonyms:5-HT-1A 5-HT1A 5-hydroxytryptamine receptor 1A (5HT1A) 5ht1a Htr1a Serotonin 1a (5-HT1a) receptor/Adrenergic receptor alpha-1 | Serotonin receptor 1A
Type:G Protein-Coupled Receptor (GPCR)
Mol. Mass.:46445.29
Organism:Rattus norvegicus (rat)
Description:Binding assays were performed using rat hippocampal membranes.
Residue:422
Component 3
Name:5-hydroxytryptamine receptor 1B
Synonyms:5-HT-1B 5-hydroxytryptamine receptor 1B (5HT1B) 5ht1b Serotonin 1 (5-HT1) receptor Serotonin receptor 1B
Type:Protein
Mol. Mass.:43173.33
Organism:Rattus norvegicus (Rat)
Description:P28564
Residue:386
Component 4
Name:5-hydroxytryptamine receptor 1F
Synonyms:5-HT-1F 5-hydroxytryptamine receptor 1F 5ht1f Serotonin 1 (5-HT1) receptor Serotonin receptor 1F
Type:Enzyme Catalytic Domain
Mol. Mass.:41896.93
Organism:RAT
Description:5-HT1F HTR1F RAT::P30940
Residue:366
BDBM50026963
NameBDBM50026963
Synonyms:11-(1-Methyl-piperidin-4-ylidene)-6,11-dihydro-5H-benzo[d]pyrrolo[1,2-a]azepine-9-carbonitrile | CHEMBL176365
TypeSmall organic molecule
Emp. Form.C20H21N3
Mol. Mass.303.4008
SMILES[#6]-[#7]-1-[#6]-[#6]\[#6](-[#6]-[#6]-1)=[#6]-1\c2cccn2-[#6]-[#6]-c2ccc(cc-12)C#N