Reaction Details
TargetAlpha-2A adrenergic receptor
LigandBDBM50026968
Substrate/Competitorn/a
Meas. Tech.ChEBML_33039
Ki 310±n/a nM
Citation Remy, DCBritcher, SFKing, SWAnderson, PSHunt, CARandall, WCBélanger, PAtkinson, JGGirard, YRooney, CSFuentes, JJTotaro, JARobinson, JLRisley, EAWilliams, M Synthesis and receptor binding studies relevant to the neuroleptic activities of some 1-methyl-4-piperidylidene-9-substituted-pyrrolo[2,1-b][3]benzazepine derivatives. J Med Chem26:974-80 (1983) Alpha-2A adrenergic receptor
Name:Alpha-2A adrenergic receptor
Type:Enzyme Catalytic Domain
Mol. Mass.:49275.13
Organism:BOVINE
Description:adrenergic Alpha2 0 BOVINE::Q28838
Residue:452
BDBM50026968
NameBDBM50026968
Synonyms:9-Chloro-11-(1-methyl-piperidin-4-ylidene)-11H-benzo[d]pyrrolo[1,2-a]azepine | CHEMBL415761
TypeSmall organic molecule
Emp. Form.C19H19ClN2
Mol. Mass.310.821
SMILES[#6]-[#7]-1-[#6]-[#6]\[#6](-[#6]-[#6]-1)=[#6]-1/c2cccn2-[#6]=[#6]-c2ccc(Cl)cc-12