Reaction Details
TargetThymidylate synthase
LigandBDBM50028107
Substrate/Competitorn/a
Meas. Tech.ChEMBL_209774 (CHEMBL815564)
Ki 250±n/a nM
Citation Srinivasan, AAmarnath, VBroom, ADZou, FCCheng, YC A potent multisubstrate analogue inhibitor of human thymidylate synthetase. J Med Chem27:1710-7 (1985) Thymidylate synthase
Name:Thymidylate synthase
Type:Enzyme
Mol. Mass.:35718.07
Organism:Homo sapiens (Human)
Description:n/a
Residue:313
BDBM50028107
NameBDBM50028107
Synonyms:2-{4-[(2-Amino-5-{1-[5-(dihydroxy-phosphanyloxymethyl)-4-hydroxy-tetrahydro-furan-2-yl]-2,4-dioxo-1,2,3,4-tetrahydro-pyrimidin-5-ylmethyl}-4-oxo-3,4,5,6,7,8-hexahydro-pyrido[3,2-d]pyrimidin-6-ylmethyl)-amino]-benzoylamino}-pentanedioic acid CID44292649 | thvmidvlate svnthase inhibitor 2b
TypeSmall organic molecule
Emp. Form.C30H37N8O13P
Mol. Mass.748.6343
SMILESNc1nc2CCC(CNc3ccc(cc3)C(=O)NC(CCC(O)=O)C(O)=O)N(Cc3cn([C@H]4C[C@H](O)[C@@H](COP(O)O)O4)c(=O)[nH]c3=O)c2c(=O)[nH]1