Reaction Details
TargetThymidylate synthase
LigandBDBM50028108
Substrate/Competitorn/a
Meas. Tech.ChEMBL_209774 (CHEMBL815564)
Ki 3000±n/a nM
Citation Srinivasan, AAmarnath, VBroom, ADZou, FCCheng, YC A potent multisubstrate analogue inhibitor of human thymidylate synthetase. J Med Chem27:1710-7 (1985) Thymidylate synthase
Name:Thymidylate synthase
Type:Enzyme
Mol. Mass.:35718.07
Organism:Homo sapiens (Human)
Description:n/a
Residue:313
BDBM50028108
NameBDBM50028108
Synonyms:2'-Deoxyuridinemonophosphate Phosphoric acid mono-[5-(2,4-dioxo-3,4-dihydro-2H-pyrimidin-1-yl)-3-hydroxy-tetrahydro-furan-2-ylmethyl] ester
TypeSmall organic molecule
Emp. Form.C9H13N2O8P
Mol. Mass.308.1819
SMILESO[C@H]1C[C@@H](O[C@@H]1COP(O)(O)=O)n1ccc(=O)[nH]c1=O