Reaction Details
TargetXanthine dehydrogenase/oxidase
LigandBDBM50028122
Substrate/Competitorn/a
Meas. Tech.ChEBML_216940
Ki 3000±n/a nM
Citation Seela, FBussmann, WGötze, ARosemeyer, H Isomeric N-methyl-7-deazaguanines: synthesis, structural assignment, and inhibitory activity on xanthine oxidase. J Med Chem27:981-5 (1984) Xanthine dehydrogenase/oxidase
Name:Xanthine dehydrogenase/oxidase
Type:Protein
Mol. Mass.:146809.00
Organism:Bos taurus (Bovine)
Description:P80457
Residue:1332
BDBM50028122
NameBDBM50028122
Synonyms:2-Amino-3,7-dihydro-pyrrolo[2,3-d]pyrimidin-4-one 2-Amino-7H-pyrrolo[2,3-d]pyrimidin-4-ol
TypeSmall organic molecule
Emp. Form.C6H6N4O
Mol. Mass.150.138
SMILESNc1nc2[nH]ccc2c(=O)[nH]1