Reaction Details
TargetAngiotensin-converting enzyme
LigandBDBM50020771
Substrate/Competitorn/a
Meas. Tech.ChEBML_34798
IC50 5±n/a nM
Citation Suh, JTSkiles, JWWilliams, BEYoussefyeh, RDJones, HLoev, BNeiss, ESSchwab, AMann, WSKhandwala, A Angiotensin-converting enzyme inhibitors. New orally active antihypertensive (mercaptoalkanoyl)- and [(acylthio)alkanoyl]glycine derivatives. J Med Chem28:57-66 (1985) Angiotensin-converting enzyme
Name:Angiotensin-converting enzyme
Type:n/a
Mol. Mass.:150405.15
Organism:Oryctolagus cuniculus
Description:n/a
Residue:1310
BDBM50020771
NameBDBM50020771
Synonyms:CHEMBL160361 | [(3-Mercapto-2-methyl-propionyl)-p-tolyl-amino]-acetic acid
TypeSmall organic molecule
Emp. Form.C13H17NO3S
Mol. Mass.267.344
SMILESCC(CS)C(=O)N(CC(O)=O)c1ccc(C)cc1