Reaction Details
TargetAngiotensin-converting enzyme
LigandBDBM50020798
Substrate/Competitorn/a
Meas. Tech.ChEBML_34798
IC50 31±n/a nM
Citation Suh, JTSkiles, JWWilliams, BEYoussefyeh, RDJones, HLoev, BNeiss, ESSchwab, AMann, WSKhandwala, A Angiotensin-converting enzyme inhibitors. New orally active antihypertensive (mercaptoalkanoyl)- and [(acylthio)alkanoyl]glycine derivatives. J Med Chem28:57-66 (1985) Angiotensin-converting enzyme
Name:Angiotensin-converting enzyme
Type:n/a
Mol. Mass.:150405.15
Organism:Oryctolagus cuniculus
Description:n/a
Residue:1310
BDBM50020798
NameBDBM50020798
Synonyms:CHEMBL1788148 [Cycloheptyl-(3-mercapto-2-methyl-propionyl)-amino]-acetic acid | [Cycloheptyl-(3-mercapto-2-methyl-propionyl)-amino]-acetic acid; Dicyclohexyl amine salt
TypeSmall organic molecule
Emp. Form.C13H23NO3S
Mol. Mass.273.392
SMILESCC(CS)C(=O)N(CC(O)=O)C1CCCCCC1