Reaction Details
TargetAdenosine receptor A1
LigandBDBM50118810
Substrate/Competitorn/a
Meas. Tech.ChEBML_29335
Ki 1.2±n/a nM
Citation Moos, WHSzotek, DSBruns, RF N6-cycloalkyladenosines. Potent, A1-selective adenosine agonists. J Med Chem28:1383-4 (1985) Adenosine receptor A1
Name:Adenosine receptor A1
Type:Protein
Mol. Mass.:36704.13
Organism:Rattus norvegicus (rat)
Description:n/a
Residue:326
BDBM50118810
NameBDBM50118810
Synonyms:(2R,3S,4R,5R)-2-(hydroxymethyl)-5-(6-((R)-1-phenylpropan-2-ylamino)-9H-purin-9-yl)-tetrahydrofuran-3,4-diol CHEMBL139000 R-N6-(phenylisopropyl)adenosine
TypeSmall organic molecule
Emp. Form.C19H23N5O4
Mol. Mass.385.417
SMILESC[C@H](Cc1ccccc1)Nc1ncnc2n(cnc12)[C@@H]1O[C@H](CO)[C@@H](O)[C@H]1O