Reaction Details
TargetAngiotensin-converting enzyme
LigandBDBM50421710
Substrate/Competitorn/a
Meas. Tech.ChEMBL_34781 (CHEMBL646063)
IC50 7.50±n/a nM
Citation Watthey, JWStanton, JLDesai, MBabiarz, JEFinn, BM Synthesis and biological properties of (carboxyalkyl)amino-substituted bicyclic lactam inhibitors of angiotensin converting enzyme. J Med Chem28:1511-6 (1985) Angiotensin-converting enzyme
Name:Angiotensin-converting enzyme
Type:n/a
Mol. Mass.:150405.15
Organism:Oryctolagus cuniculus
Description:n/a
Residue:1310
BDBM50421710
NameBDBM50421710
Synonyms:CHEMBL2093973
TypeSmall organic molecule
Emp. Form.C23H26N2O5
Mol. Mass.410.4629
SMILESOC(=O)CN1c2ccccc2CCC[C@H](N[C@@H](CCc2ccccc2)C(O)=O)C1=O