Reaction Details
TargetAngiotensin-converting enzyme
LigandBDBM50021138
Substrate/Competitorn/a
Meas. Tech.ChEBML_35992
IC50 4±n/a nM
Citation Stanton, JLWatthey, JWDesai, MNFinn, BMBabiarz, JETomaselli, HC Angiotensin converting enzyme inhibitors: structure-activity profile of 1-benzazepin-2-one derivatives. J Med Chem28:1603-6 (1985) Angiotensin-converting enzyme
Name:Angiotensin-converting enzyme
Type:Enzyme
Mol. Mass.:149709.01
Organism:Homo sapiens (Human)
Description:n/a
Residue:1306
BDBM50021138
NameBDBM50021138
Synonyms:2-(1-Carboxymethyl-2-oxo-2,3,4,5-tetrahydro-1H-benzo[b]azepin-3-ylamino)-3-phenylsulfanyl-propionic acid | CHEMBL38613
TypeSmall organic molecule
Emp. Form.C21H22N2O5S
Mol. Mass.414.475
SMILESOC(=O)CN1c2ccccc2CC[C@H](N[C@@H](CSc2ccccc2)C(O)=O)C1=O