Reaction Details
TargetAngiotensin-converting enzyme
LigandBDBM50021148
Substrate/Competitorn/a
Meas. Tech.ChEBML_35992
IC50 2.9±n/a nM
Citation Stanton, JLWatthey, JWDesai, MNFinn, BMBabiarz, JETomaselli, HC Angiotensin converting enzyme inhibitors: structure-activity profile of 1-benzazepin-2-one derivatives. J Med Chem28:1603-6 (1985) Angiotensin-converting enzyme
Name:Angiotensin-converting enzyme
Type:Enzyme
Mol. Mass.:149709.01
Organism:Homo sapiens (Human)
Description:n/a
Residue:1306
BDBM50021148
NameBDBM50021148
Synonyms:3-Benzylsulfanyl-2-(1-carboxymethyl-2-oxo-2,3,4,5-tetrahydro-1H-benzo[b]azepin-3-ylamino)-propionic acid | CHEMBL289267
TypeSmall organic molecule
Emp. Form.C22H24N2O5S
Mol. Mass.428.501
SMILESOC(=O)CN1c2ccccc2CC[C@H](N[C@@H](CSCc2ccccc2)C(O)=O)C1=O