Reaction Details
TargetRenin
LigandBDBM50025949
Substrate/Competitorn/a
Meas. Tech.ChEMBL_196092 (CHEMBL872310)
IC50 140±n/a nM
Citation Boger, JPayne, LSPerlow, DSLohr, NSPoe, MBlaine, EHUlm, EHSchorn, TWLaMont, BILin, TY Renin inhibitors. Syntheses of subnanomolar, competitive, transition-state analogue inhibitors containing a novel analogue of statine. J Med Chem28:1779-90 (1986) Renin
Name:Renin
Type:Enzyme
Mol. Mass.:45058.99
Organism:Homo sapiens (Human)
Description:n/a
Residue:406
BDBM50025949
NameBDBM50025949
Synonyms:4-[2-(2-Acetylamino-3-phenyl-propionylamino)-3-(1H-imidazol-4-yl)-propionylamino]-3-hydroxy-6-methyl-heptanoic acid [1-(1-carbamoyl-2-phenyl-ethylcarbamoyl)-3-methyl-butyl]-amide | CHEMBL3144414
TypeSmall organic molecule
Emp. Form.C40H56N8O7
Mol. Mass.760.922
SMILESCC(C)C[C@H](NC(=O)[C@H](Cc1c[nH]cn1)NC(=O)[C@H](Cc1ccccc1)NC(C)=O)[C@@H](O)CC(=O)N[C@@H](CC(C)C)C(=O)N[C@@H](Cc1ccccc1)C(N)=O