Reaction Details
TargetRenin
LigandBDBM50025941
Substrate/Competitorn/a
Meas. Tech.ChEMBL_196092 (CHEMBL872310)
IC50 5.1±n/a nM
Citation Boger, JPayne, LSPerlow, DSLohr, NSPoe, MBlaine, EHUlm, EHSchorn, TWLaMont, BILin, TY Renin inhibitors. Syntheses of subnanomolar, competitive, transition-state analogue inhibitors containing a novel analogue of statine. J Med Chem28:1779-90 (1986) Renin
Name:Renin
Type:Enzyme
Mol. Mass.:45058.99
Organism:Homo sapiens (Human)
Description:n/a
Residue:406
BDBM50025941
NameBDBM50025941
Synonyms:CHEMBL3144415 | {1-[1-{3-[1-(1-Carbamoyl-2-phenyl-ethylcarbamoyl)-3-methyl-butylcarbamoyl]-1-cyclohexylmethyl-2-hydroxy-propylcarbamoyl}-2-(1H-imidazol-4-yl)-ethylcarbamoyl]-2-phenyl-ethyl}-carbamic acid isopropyl ester
TypeSmall organic molecule
Emp. Form.C45H64N8O8
Mol. Mass.845.0385
SMILESCC(C)C[C@H](NC(=O)C[C@H](O)[C@H](CC1CCCCC1)NC(=O)[C@H](Cc1c[nH]cn1)NC(=O)[C@H](Cc1ccccc1)NC(=O)OC(C)C)C(=O)N[C@@H](Cc1ccccc1)C(N)=O