Reaction Details
TargetSodium-dependent serotonin transporter
LigandBDBM50021219
Substrate/Competitorn/a
Meas. Tech.ChEBML_176338
IC50 0.030000±n/a nM
Citation Bøgesø, KPChristensen, AVHyttel, JLiljefors, T 3-Phenyl-1-indanamines. Potential antidepressant activity and potent inhibition of dopamine, norepinephrine, and serotonin uptake. J Med Chem28:1817-28 (1986) Sodium-dependent serotonin transporter
Name:Sodium-dependent serotonin transporter
Type:Multi-pass membrane protein
Mol. Mass.:70168.43
Organism:Rattus norvegicus (rat)
Description:P31652
Residue:630
BDBM50021219
NameBDBM50021219
Synonyms:CHEMBL553648 | [3-(2,4-Dichloro-phenyl)-indan-1-yl]-dimethyl-amine; hydrochloride
TypeSmall organic molecule
Emp. Form.C17H17Cl2N
Mol. Mass.306.23
SMILESCN(C)C1CC(c2ccccc12)c1ccc(Cl)cc1Cl