Reaction Details
TargetDihydrofolate reductase
LigandBDBM50026315
Substrate/Competitorn/a
Meas. Tech.ChEBML_54542
Ki 11±n/a nM
Citation Kuyper, LFRoth, BBaccanari, DPFerone, RBeddell, CRChampness, JNStammers, DKDann, JGNorrington, FEBaker, DJ Receptor-based design of dihydrofolate reductase inhibitors: comparison of crystallographically determined enzyme binding with enzyme affinity in a series of carboxy-substituted trimethoprim analogues. J Med Chem28:303-11 (1985) Dihydrofolate reductase
Name:Dihydrofolate reductase
Type:n/a
Mol. Mass.:17532.46
Organism:Escherichia coli
Description:n/a
Residue:157
BDBM50026315
NameBDBM50026315
Synonyms:CHEMBL266611 | [5-(2,4-Diamino-pyrimidin-5-ylmethyl)-2,3-dimethoxy-phenoxy]-acetic acid methyl ester
TypeSmall organic molecule
Emp. Form.C16H20N4O5
Mol. Mass.348.3538
SMILESCOC(=O)COc1cc(Cc2cnc(N)nc2N)cc(OC)c1OC