Reaction Details
TargetAngiotensin-converting enzyme
LigandBDBM50020827
Substrate/Competitorn/a
Meas. Tech.ChEBML_34797
IC50 0.025±n/a nM
Citation Menard, PRSuh, JTJones, HLoev, BNeiss, ESWilde, JSchwab, AMann, WS Angiotensin converting enzyme inhibitors. (Mercaptoaroyl)amino acids. J Med Chem28:328-32 (1985) Angiotensin-converting enzyme
Name:Angiotensin-converting enzyme
Type:n/a
Mol. Mass.:150405.15
Organism:Oryctolagus cuniculus
Description:n/a
Residue:1310
BDBM50020827
NameBDBM50020827
Synonyms:CHEMBL324898 | [Cyclopentyl-(3-mercapto-benzoyl)-amino]-acetic acid
TypeSmall organic molecule
Emp. Form.C14H17NO3S
Mol. Mass.279.355
SMILESOC(=O)CN(C1CCCC1)C(=O)c1cccc(S)c1