Reaction Details
TargetAngiotensin-converting enzyme
LigandBDBM50020830
Substrate/Competitorn/a
Meas. Tech.ChEBML_34797
IC50 0.001±n/a nM
Citation Menard, PRSuh, JTJones, HLoev, BNeiss, ESWilde, JSchwab, AMann, WS Angiotensin converting enzyme inhibitors. (Mercaptoaroyl)amino acids. J Med Chem28:328-32 (1985) Angiotensin-converting enzyme
Name:Angiotensin-converting enzyme
Type:n/a
Mol. Mass.:150405.15
Organism:Oryctolagus cuniculus
Description:n/a
Residue:1310
BDBM50020830
NameBDBM50020830
Synonyms:CHEMBL263056 | [Cyclopentyl-(2-mercapto-3-trifluoromethyl-benzoyl)-amino]-acetic acid
TypeSmall organic molecule
Emp. Form.C15H16F3NO3S
Mol. Mass.347.353
SMILESOC(=O)CN(C1CCCC1)C(=O)c1cccc(c1S)C(F)(F)F