Reaction Details
TargetAngiotensin-converting enzyme
LigandBDBM50020833
Substrate/Competitorn/a
Meas. Tech.ChEBML_34797
IC50 0.000±n/a nM
Citation Menard, PRSuh, JTJones, HLoev, BNeiss, ESWilde, JSchwab, AMann, WS Angiotensin converting enzyme inhibitors. (Mercaptoaroyl)amino acids. J Med Chem28:328-32 (1985) Angiotensin-converting enzyme
Name:Angiotensin-converting enzyme
Type:n/a
Mol. Mass.:150405.15
Organism:Oryctolagus cuniculus
Description:n/a
Residue:1310
BDBM50020833
NameBDBM50020833
Synonyms:CHEMBL326137 | [(3-Chloro-2-mercapto-benzoyl)-cyclopentyl-amino]-acetic acid
TypeSmall organic molecule
Emp. Form.C14H16ClNO3S
Mol. Mass.313.8
SMILESOC(=O)CN(C1CCCC1)C(=O)c1cccc(Cl)c1S