Reaction Details
TargetAngiotensin-converting enzyme
LigandBDBM50367249
Substrate/Competitorn/a
Meas. Tech.ChEBML_36003
Ki 0.500000±n/a nM
Citation Andrews, PRCarson, JMCaselli, ASpark, MJWoods, R Conformational analysis and active site modelling of angiotensin-converting enzyme inhibitors. J Med Chem28:393-9 (1985) Angiotensin-converting enzyme
Name:Angiotensin-converting enzyme
Type:Enzyme
Mol. Mass.:149709.01
Organism:Homo sapiens (Human)
Description:n/a
Residue:1306
BDBM50367249
NameBDBM50367249
Synonyms:CHEMBL309601
TypeSmall organic molecule
Emp. Form.C16H23N2O5P
Mol. Mass.354.338
SMILESC[C@H](NP(O)(=O)CCc1ccccc1)C(=O)N1CCC[C@H]1C(O)=O